transcript
type: Class
subclass of: E31 Document
comment: Transkription der Inschrift im Textfeld.

info object type name
type: Class
subclass of: E75 Conceptual Object Appellation
comment: Name des Typus des object information.

post sermon first line
type: Class
comment: Lied nach der Predigt wird durch die erste Liedzeile identfiziert.
subclass of: E75 Conceptual Object Appellation

artist signature feature
type: Class
comment: Darstellung der Künstlersignatur.
subclass of: E26 Physical Feature

family
type: Class
subclass of: E74 Group
comment: Familienverband.

interpretation type name
type: Class
comment: Name des Interpretationtypus.
subclass of: E75 Conceptual Object Appellation

peace event
type: Class
comment: Beschreibt Friedensschluss im weitesten Sinn.
subclass of: E7 Activity

object area
type: Class
comment: Segment oder Platz auf dem physischen Objekt, wie unten links oder aehnliches.
subclass of: E53 Place

occassion type name
type: Class
comment: Name fuer die Art des Anlasses.
subclass of: E75 Conceptual Object Appellation

measure unit
type: Class
subclass of: E58 Measurement Unit
comment: Maßeinheit.

object title
type: Class
subclass of: E35 Title
comment: Titel des Objektes (Medaille, Druckgrafik etc.)

publisher name
type: Class
comment: Name der des Verlages.
subclass of: E82 Actor Appellation

participant name
type: Class
subclass of: E82 Actor Appellation
comment: Name des am Friedenereignis beteiligten Person.

language type name
type: Class
comment: Name der Textsprache des object information.
subclass of: E75 Conceptual Object Appellation

person
type: Class
subclass of: E21 Person
comment: Alle Personen, die im Zusammenhang mit dem Friedensprojekt vorkommen.

design place
type: Class
comment: Herstellungsort
subclass of: E53 Place

text type name
type: Class
comment: Name des Artes des Textes eines information object.
subclass of: E75 Conceptual Object Appellation

period war
type: Class
subclass of: E4 Period
comment: Uebergeordnetes Friedenereignis wie der Nordische Krieg oder Dreissigjaehrige Krieg.

object
type: Class
comment: Objektuebergreifend
subclass of: E84 Information Carrier

editing status
type: Class
subclass of: E55 Type
comment: Bearbeitungsstatus eines Eintrages

recipient name
type: Class
comment: Name des Widmungsempfaenger.
subclass of: E82 Actor Appellation

measure
type: Class
comment: Maße des Objektes.
subclass of: E54 Dimension

instrument single
type: Class
comment: Anzahl eines Instrumentes.
subclass of: E54 Dimension

inscription
type: Class
subclass of: E34 Inscription
comment: Medailleninschrift.

source author name
type: Class
comment: Name des Autors der Nachweisliteratur des Objektes.
subclass of: E82 Actor Appellation

info object type
type: Class
subclass of: E55 Type
comment: Typ des information object, der allgemein unterteilt in Musik, Text und Bild.

source author
type: Class
subclass of: E21 Person
comment: Autor der Nachweisliteratur für das Objekt.

source page
type: Class
subclass of: E42 Identifier
comment: Seitenzahl der Nachweisliteratur.

project member name
type: Class
subclass of: E82 Actor Appellation
comment: Name des Projektmitgliedes als Bearbeiter

measure type name
type: Class
comment: Name des Messtypes: Blattmaß, Bildmaß etc.
subclass of: E75 Conceptual Object Appellation

source
type: Class
subclass of: E31 Document
comment: Literaturnachweis fuer das Objekt.

book container
type: Class
subclass of: E84 Information Carrier
comment: Buchobjekt, dass Buchillustrationen bzw. Seiten enthaelt und auf das verwiesen wird.

inscription feature
type: Class
subclass of: E26 Physical Feature
comment: Darstellung der Medailleninschrift.

exhibit pick
type: Class
comment: Auswahl fuer das Themenportal.
subclass of: E87 Curation Activity

performance place name
type: Class
comment: Name der weiteren Aufführungsorte.
subclass of: E48 Place Name

digi url
type: Class
comment: Link zum Digitalisat einer Bibliothek.
subclass of: E42 Identifier

depositum
type: Class
comment: Speziell fuer die Medaillen, die in einem Depositum liegen, Eigentuemerverhaeltnisse nicht vollstaendig geklaert.
subclass of: E40 Legal Body

technique name
type: Class
comment: Name der Herstellungstechnik.
subclass of: E75 Conceptual Object Appellation

editing status type
type: Class
subclass of: E75 Conceptual Object Appellation
comment: Bearbeitungsstatus bzw. Bearbeitungsstand

location place type
type: Class
subclass of: E55 Type
comment: Standorttyp wie Schrank, Schublade etc.

commissioner name
type: Class
comment: Name des Auftraggebers.
subclass of: E82 Actor Appellation

sermon source
type: Class
comment: Perikope, sprich Textstelle, auf der der Predigttext fußt bzw. die er enthält.
subclass of: E31 Document

attribution type name
type: Class
subclass of: E75 Conceptual Object Appellation
comment: Name der Zuschreibungsart (Umkreis, Werkstatt etc.).

interpretation person type
type: Class
subclass of: E55 Type
comment: Person, die man interpretieren kann , aufgrund der tatsaechlich abgebildeten.

info object
type: Class
comment: Beschaeftigt sich mit allem, was auf dem Carrier dargestellt ist. Ikomografie, Texte, Noten etc. und nicht mit der physischen Ausformung des Objektes.
subclass of: E73 Information Object

production
type: Class
comment: Herstellungsprozess
subclass of: E12 Production

function
type: Class
comment: Funktion einer Person in Zusammenhang mit einem Friedensereignis, wie Herrscher, Vertragsunterzeichner, Heerführer etc.
subclass of: E40 Legal Body

representation type name
type: Class
comment: Name des Friedensikonografie-Typus.
subclass of: E75 Conceptual Object Appellation

aria number type
type: Class
comment: Anzahl der Arien.
subclass of: E55 Type

artist
type: Class
comment: Ausführender bildender Künstler.
subclass of: E21 Person

aria order
type: Class
subclass of: E55 Type
comment: Ordnungsnummer einer Arie im Zusammenhang der Oper.

premiere place name
type: Class
subclass of: E48 Place Name
comment: Name des Ortes der Erstaufführung.

performance date
type: Class
subclass of: E52 Time-Span
comment: Datum weiterer Auffuehrungen.

writing material
type: Class
subclass of: material
comment: Nur Beschreibstoffe.

material
type: Class
comment: Sämtliches Material, dass verwendet wurde außer Beschreibstoffe.
subclass of: E57 Material

technique
type: Class
comment: Herstellungstechnik.
subclass of: E29 Design or Procedure

war countries
type: Class
subclass of: E74 Group
comment: Beteiligte Laender sind eine Gruppe von Menschen fuer die ein bestimmter Herrscher steht, die in diesem Fall aber nicht als tatsaechliche Orte, sondern als Kooperationen behandelt werden.

vocal role type name
type: Class
subclass of: E75 Conceptual Object Appellation
comment: Bezeichnung des Charakters oder der Rolle einer Stimme.

exhibit text
type: Class
comment: Austellungstext im Freitextfeld.
subclass of: E31 Document

pre sermon
type: Class
comment: Info object, das nur im Zusammenhang mit der Kategorie Predigt vorkommt: Lied vor der Predigt, wird mit Strophenanfang dokumentiert.
subclass of: E73 Information Object

dedication
type: Class
subclass of: E7 Activity
comment: Ereignis der Widmung.

pages
type: Class
comment: Anzahl der gesamten Seiten eines Buches, das waehrend eines Produktionsereignisses hergestellt wurde.
subclass of: E54 Dimension

collection
type: Class
comment: Verwahrende Institution
subclass of: E40 Legal Body

location place number
type: Class
subclass of: E42 Identifier
comment: Nummer, die zum Standorttyp gehoert.

publisher mint place
type: Class
subclass of: E53 Place
comment: Ort der Institution Münzstätte oder Verlag.

ppn
type: Class
subclass of: E42 Identifier
comment: Feld fuer die PPN, das ist die Indentifikationsnummer im Pica-System.

collector mark source
type: Class
comment: Kurztitel fuer den Nachweis des Sammlerstempels.
subclass of: E31 Document

aria tonality type
type: Class
comment: Tonalitaet einer Arie.
subclass of: E55 Type

FV link
type: Class
subclass of: E42 Identifier
comment: Link zur Friedensvertraege-Datenbank des Leibniz-Instituts fuer Europaeische Geschichte.

attribution type
type: Class
comment: Art der Zuschreibung: Werkstatt, Umkreis, zugeschrieben.
subclass of: E55 Type

project member
type: Class
comment: Projektmitarbeiter als Bearbeiter eines Eintrages.
subclass of: E21 Person

collection place name
type: Class
subclass of: E48 Place Name
comment: Name des Ortes der verwahrenden Institution

peace party
type: Class
comment: Die am Friedensschluss beteiligten Parteien.
subclass of: E74 Group

original exam
type: Class
comment: Bei Bearbeitungsstatus nur Typ Original geprueft einzugeben.
subclass of: E55 Type

peace place territory name
type: Class
subclass of: E44 Place Appellation
comment: Name des Territoriums, in dem sich der Ort im Zusammenhang mit dem Friedenereignis befindet.

thesis capital type
type: Class
comment: Kapitel der Dissertation, in dem das dokumentierte Objekt aufgenommen werden wird.
subclass of: thesis type

thesis type
type: Class
comment: Ausschliessliche Typisierung fuer die Dissertations-Objekte von Frau Schwartz.
subclass of: E55 Type

object sub title
type: Class
comment: Untertitel
subclass of: E35 Title

instrument role type name
type: Class
subclass of: E75 Conceptual Object Appellation
comment: Bezeichnung der Funktion eines Einzelinstrumentes.

collector mark
type: Class
comment: Sammlerstempel.
subclass of: E37 Mark

book container production
type: Class
comment: Herstellung des Sammelwerkes, auf das bei Buchillustrationen und Seiten verwiesen wird (das "enthalten in"-Werk).
subclass of: E12 Production

design assignment
type: Class
comment: Beschreibung des Herstellungsprozesses des Objektes.
subclass of: E13 Attribute Assignment

commissioner
type: Class
subclass of: E21 Person
comment: Auftraggeber

peace place territory
type: Class
comment: Territorium des Ortes im Zusammenhang der Friedensereignisse.
subclass of: E53 Place

material name
type: Class
subclass of: E75 Conceptual Object Appellation
comment: Name des Materials, das verwendet wurde, außer Beschreibstoffe.

source title
type: Class
comment: Kurztitel der Nachweisliteratur fuer das Objekt.
subclass of: E35 Title

coat of arms place
type: Class
comment: Ort des Wappens
subclass of: E53 Place

periodical
type: Class
subclass of: E73 Information Object
comment: Reihe eines Buches.

interpretation type
type: Class
comment: Typus, der die Interpretationen aufnimmt.
subclass of: E55 Type

sheetnumber of series
type: Class
subclass of: E42 Identifier
comment: Genaue Blattnummer einer Serie.

image url
type: Class
subclass of: E38 Image
comment: Alte Klasse fuer Billder von Objekten.

language
type: Class
comment: Sprache des Textes des information object.
subclass of: E56 Language

measurement print run
type: Class
subclass of: E16 Measurement
comment: Auflagenhöhe zu einem bestimmten Produktionszeitpunkt.

place name
type: Class
subclass of: E48 Place Name
comment: Allgemeiner Ort ohne bestimmte Zuweisung wie Herstellungsort oder Sammlungsort.

peace event type
type: Class
comment: Bestimmt den Friedensschluss näher: Waffenstillstand, Exekutionskongress etc.
subclass of: E55 Type

VD16 number
type: Class
subclass of: E42 Identifier
comment: Nummer im VD16.

dedication writer
type: Class
subclass of: E21 Person
comment: Schreiber der Widmung.

sermon type assignment
type: Class
subclass of: E17 Type Assignment
comment: Alle Typenzuweisungen im Zusammenhang mit Predigttexten, da Ort, Datum, Personen intentional und auch diskussionswürdig sind.

date
type: Class
subclass of: E52 Time-Span
comment: Genaues Datum in Zahlenwerten.

family name
type: Class
subclass of: E82 Actor Appellation
comment: Name des Familienverbandes.

participant
type: Class
comment: Beteiligte Person am Friedensereignis.
subclass of: E21 Person

music instrument type
type: Class
subclass of: E55 Type
comment: Instrument als Typus, Instrumente, in der Gesamtzahl des Stückes.

audiofile
type: Class
subclass of: E84 Information Carrier
comment: Musikaufnahme

artist signature
type: Class
comment: Künstlersignatur
subclass of: E37 Mark

verbal date
type: Class
subclass of: E50 Date
comment: Datierung in Umschreibung: um, zweite Haelfte etc.

print state number
type: Class
comment: Genauer Druckzustand (mit der Angabe der gesamten Zahl), z.B. 4. von 5.
subclass of: E42 Identifier

performance place
type: Class
comment: Ort von weiteren Auffuehrungen einer Oper, Oratoriums etc.
subclass of: E53 Place

foto order
type: Class
subclass of: E7 Activity
comment: Dokumentation zur Fotobestellung

dedication writer name
type: Class
comment: Name des Widmungsschreibers.
subclass of: E82 Actor Appellation

collection place
type: Class
comment: Ort einer verwahrenden Institution
subclass of: E53 Place

location place
type: Class
comment: Standort als Teil der Inventarnummer, wie Kapsel oder Schrank, naeherer Hinweis, wo das Blatt zu finden ist.
subclass of: E53 Place

vocal aria single
type: Class
comment: Anzahl der Arien pro Einzelstimme.
subclass of: E54 Dimension

institution
type: Class
subclass of: E40 Legal Body
comment: Gemeint sind alle Institutionen im historischen Zusammenhang, z.B. Zuenfte, Korporationen etc.

concrete representation type
type: Class
comment: Tatsaechlich abgebildeter Typus.
subclass of: E55 Type

assignment of relation
type: Class
comment: Diskussion der Zugehoerigkeit.
subclass of: E13 Attribute Assignment

location place name
type: Class
comment: Name des Standortes eines Blattes oder Buches wie Kapsel, Schrank oder Regal.
subclass of: E48 Place Name

print state
type: Class
comment: Druckzustand
subclass of: E3 Condition State

measure type
type: Class
comment: Maßtyp wie Blattmaß, Durchmesser oder Gewicht.
subclass of: E55 Type

text type
type: Class
comment: Textform eine information object.
subclass of: E55 Type

premiere date
type: Class
subclass of: E52 Time-Span
comment: Datum der Erstauffuehrung.

book container title
type: Class
subclass of: E35 Title
comment: Titel des Buches, der Buchillustrationen und Seiten enthaelt.

inscription type name
type: Class
subclass of: E75 Conceptual Object Appellation
comment: Name der Art der Inschrift.

peace documentation
type: Class
subclass of: E31 Document
comment: Dokument in diesem Fall, die Formularfelder der Ereignismaske, die redigiert werden muessen.

site name
type: Class
comment: Name des Auffuehrungsortes im engeren Sinn: Theater, Marktplaetze, Kirchen etc.
subclass of: E44 Place Appellation

representation type assignment
type: Class
comment: Friedensikonografie-Typ wird zugeschrieben, im Bereich der Referenzierung eines Typuses auf eine Person, Stadt etc.
subclass of: E17 Type Assignment

vocal type name
type: Class
comment: Bezeichnung der Stimmen eines Stueckes.
subclass of: E75 Conceptual Object Appellation

periodical number
type: Class
subclass of: E42 Identifier
comment: Bandnummer innerhalb einer Reihe.

book page
type: Class
comment: Seitenzahlen, die die Seitenzahl oder Blattzahl einer Illustration oder Textseite in einem Sammelwerk angeben auf der Objekt (E84)-Ebene (enthalten in).
subclass of: E42 Identifier

vocal role type
type: Class
comment: Charakter/Rolle einer Stimme.
subclass of: E55 Type

music vocal type single
type: Class
subclass of: music vocal type
comment: Typus der Einzelstimmen eines Stueckes.

music vocal type
type: Class
subclass of: E55 Type
comment: Tyous der Stimmen eines Stueckes.

vocal all
type: Class
subclass of: E54 Dimension
comment: Gesamtzahl der Stimmen eines Stueckes.

place
type: Class
subclass of: E53 Place
comment: Alle Orte und Regionen, die mit dem Friedensprojekt im Zusammenhang stehen.

comment
type: Class
subclass of: E31 Document
comment: Kommentar im Textfeld.

copy
type: Class
comment: Weiteres Exemplar eines Objektes.
subclass of: E84 Information Carrier

section type
type: Class
comment: Vorder- oder Rueckseitentyp.
subclass of: E55 Type

aria tempo type
type: Class
subclass of: E55 Type
comment: Tempo einer Arie.

object section
type: Class
comment: Anbringungsort der Kuenstlersignatur oder Kuenstlermarke und des Sammlerstempels.
subclass of: E46 Section Definition

location number
type: Class
comment: Nummer des Standortes bei erweiterter Inventarnummer, wie Kapsel-, Schrank- oder Regalnummer.
subclass of: E45 Address

music instrument number type
type: Class
subclass of: E55 Type
comment: Einzelanzahl der Instrumente.

music place type
type: Class
subclass of: E55 Type
comment: Aufführungsort

object documentation
type: Class
comment: Bearbeitung des Eintrages zum Objekt
subclass of: E87 Curation Activity

type genre subtype
type: Class
comment: Nähere Bezeichnung der Gattung, wie Einblattdruck, Jeton etc.
subclass of: E55 Type

text
type: Class
subclass of: E33 Linguistic Object
comment: Alle Texte die das information object enthält.

collector mark feature
type: Class
subclass of: E26 Physical Feature
comment: Darstellung des Sammlerstempels.

sermon place type
type: Class
subclass of: E55 Type
comment: Predigtort, da intentional als Typ modelliert.

occassion event
type: Class
subclass of: E7 Activity
comment: Anlass zu dem ein Inhaltsobjekt erstellt wurde.

pre sermon first line
type: Class
subclass of: E75 Conceptual Object Appellation
comment: Lied vor der Predigt wird mit der ersten Liedzeile identfiziert.

type genre
type: Class
comment: Genretype: Gattungsbezeichnung allgemein, z.B. Medaille, Graphik, Buch etc.
subclass of: E55 Type

location place type name
type: Class
subclass of: E75 Conceptual Object Appellation
comment: Name des Standorttypes.

VD18 number
type: Class
comment: Nummer im VD18.
subclass of: E42 Identifier

design place name
type: Class
subclass of: E48 Place Name
comment: Name der Herstellungsortes.

image
type: Class
comment: Abbildung eines Objektes.
subclass of: E38 Image

bible myth source
type: Class
comment: Titel, die aus Kombinationen von Biblischen Buch und Vers bzw. mythologischen Dichter und Vers.
subclass of: E35 Title

person name
type: Class
comment: Personennamen.
subclass of: E82 Actor Appellation

mint
type: Class
comment: Herstellungsinstitution der Münzen.
subclass of: E40 Legal Body

collection identifier
type: Class
subclass of: E42 Identifier
comment: Identifiziert den Namen der verwahrenden Sammlung

foto order type
type: Class
subclass of: E55 Type
comment: Status der Fotobestellung

sermon person type
type: Class
comment: Person, die die Predigt angeordnet hat.
subclass of: E55 Type

location name
type: Class
subclass of: E45 Address
comment: Standortname bei näherer Bestimmung der Inventarnummer, wie Kapsel, Schrank oder Regal.

recipient
type: Class
subclass of: E21 Person
comment: Widmungsempfaenger

peace type
type: Class
comment: Typ des Friedens.
subclass of: E55 Type

series sheets
type: Class
comment: Gesamter Umfang einer Grafikserie oder eines Buches.
subclass of: E54 Dimension

copy url
type: Class
comment: URL zu weiteren Ausgaben eines Buches.
subclass of: E42 Identifier

peace event type name
type: Class
subclass of: E75 Conceptual Object Appellation
comment: Bezeichnung der naeheren Beschreibung des Friedensereignisses.

aria order name
type: Class
comment: Name des Ordnungkriteriums einer Arie.
subclass of: E75 Conceptual Object Appellation

instrument type name
type: Class
subclass of: E75 Conceptual Object Appellation
comment: Bezogen auf die alle Instrumente eines Stueckes.

instrument role type
type: Class
subclass of: E55 Type
comment: Funktion eines Einzelinstrumentes.

to do
type: Class
comment: Zettelkasten für Textfeld.
subclass of: E31 Document

inscription type
type: Class
comment: Typus der Inschrift, wie Umschrift etc.
subclass of: E55 Type

occassion event name
type: Class
subclass of: E75 Conceptual Object Appellation
comment: Name des Anlasses zu dem ein Informationsobjekt erstellt wurde.

peace event name
type: Class
comment: Name des Friedensereignisses.
subclass of: E75 Conceptual Object Appellation

post sermon
type: Class
comment: Info object, das nur in der Kategorie Predigt vorkommt: Lied nach der Predigt.
subclass of: E73 Information Object

site
type: Class
subclass of: E53 Place
comment: Standort im Sinn von Auffuehrungsort bei Opern und Predigten, das heisst Theater, Kirchen, Marktplätze etc. NICHT der Ort.

note
type: Class
comment: Anmerkungen und Notizen im Textfeld.
subclass of: E31 Document

document creation
type: Class
comment: In diesem Zusammenhang die Erzeugung des Redaktionsprozesses des peace documentation.
subclass of: E65 Creation

publisher
type: Class
subclass of: E40 Legal Body
comment: Institution des Verlages.

section type name
type: Class
comment: Recto und Verso ausschließlich.
subclass of: E75 Conceptual Object Appellation

premiere place
type: Class
subclass of: E53 Place
comment: Ort der Erstauffuehrung von Opern, Oratorien etc.

series
type: Class
comment: Serie von Grafiken.
subclass of: E73 Information Object

volumes
type: Class
comment: Zahl der hergestellten Baende, waehrend EINES Produktionsereignisses.
subclass of: E54 Dimension

periodical title
type: Class
subclass of: E35 Title
comment: Titel einer Reihe.

artist signature type
type: Class
comment: Art der Kuenstlersignatur: Monogramm, Zusatz, Adresse.
subclass of: E55 Type

music type assignment
type: Class
subclass of: E17 Type Assignment
comment: Alle Typenzuweisungen im Bereich der Musik, wie Auffuehrungsort, Auffuehrungsdatum etc.

creation info object
type: Class
comment: Herstellung des information object.
subclass of: E65 Creation

music date type
type: Class
comment: Auffuehrungsdatum .
subclass of: E55 Type

artist name
type: Class
subclass of: E82 Actor Appellation
comment: Name des ausführenden bildenden Künstlers.

VD17 number
type: Class
subclass of: E42 Identifier
comment: Nummer im VD17.

category type
type: Class
comment: Kategorientyp von Juergens Citavi-Datenbank, wird nach Bearbeitung von Herrn Juergens geloescht.
subclass of: E55 Type

repro type
type: Class
comment: Status der Reproduktionsrechte bei einer Fotobestellung
subclass of: E55 Type

relation type
type: Class
comment: Typus der Zugehoerigkeit.
subclass of: E55 Type

music instrument single type
type: Class
comment: Einzelinstrument.
subclass of: music instrument type

mint name
type: Class
subclass of: E82 Actor Appellation
comment: Name der Muenzstätte

writing material name
type: Class
comment: Name der Beschreibstoffe.
subclass of: material name

inventory number
type: Class
comment: Inventarnummer, d.h. unter welcher Inventarnummer (Objekt) oder Signatur (Buch) das Objekt in der jeweiligen Sammlung heute auffindbar ist.
subclass of: E42 Identifier

object extra title
type: Class
comment: Titelzusatz.
subclass of: E35 Title

web exhibit
type: Class
subclass of: E78 Collection
comment: Themenportal am Ende des Projektes.

occassion event type
type: Class
subclass of: E55 Type
comment: Art des Anlasses.

excerpt
type: Class
comment: Textfeld für Exzerpte.
subclass of: E31 Document

print state type
type: Class
subclass of: E55 Type
comment: Beschreibung bzw. Typisierung des Druckzustandes.

peace party name
type: Class
subclass of: E82 Actor Appellation
comment: Name der am Friedensschluss beteiligten Parteien.

all instrument number type
type: Class
subclass of: E55 Type
comment: Gesamtzahl der Instrumente in einem Stueck.

source type
type: Class
comment: Bei den Darstellungen, der Typus der Darstellung, der von einer literarischen Quelle generiert wird.
subclass of: E55 Type

book container author
type: Class
comment: Verfasser des Sammelwerkes auf das verwiesen wird, wenn man Buchillustrationen und Seiten aufnimmt (enthaltenes Werk).
subclass of: E21 Person

series title
type: Class
subclass of: E35 Title
comment: Titel von Serien im Grafikbereich, der übergeordnete Titel eines Blattes bzw. dessen Originaltitel.

sermon date type
type: Class
subclass of: E55 Type
comment: Typus des Predigtdatums, da intentional.

measure unit name
type: Class
comment: Name der Maßeinheit, wie g, cm und mm.
subclass of: E75 Conceptual Object Appellation

foto creation
type: Class
comment: Fotoerstellungsevent
subclass of: E65 Creation

measurement edition
type: Class
subclass of: E16 Measurement
comment: Zahl der Auflage an einem bestimmten Produktionszeitpunkt.

exhibit section
type: Class
comment: Praesentationsgruppe im Themenportal.
subclass of: E46 Section Definition

type genre name
type: Class
subclass of: E75 Conceptual Object Appellation
comment: Gattungsbezeichnung

info genre type
type: Class
subclass of: E55 Type
comment: Genre von Bild-, Text- und Musikobjekten in der Inhaltsmaske.

sermon source title
type: Class
comment: Nachweis der Perikope.
subclass of: E35 Title

relation type assignment
type: Class
subclass of: E17 Type Assignment
comment: Zuschreibung des Zugehoerigkeitstyps.

design role name
type: Class
subclass of: E75 Conceptual Object Appellation
comment: Name der Herstellerrolle.

concrete person type
type: Class
subclass of: E55 Type
comment: Die tatsaechlich abgebildete Person als Typus.

print state type name
type: Class
subclass of: E75 Conceptual Object Appellation
comment: Beschreibung des Druckzustandes: E.A. oder vor Schrift.

concrete representation type name
type: Class
subclass of: E75 Conceptual Object Appellation
comment: Name des Typus, der das tatsaechlich Abgebildete.

publisher mint place name
type: Class
subclass of: E48 Place Name
comment: Name des Verlags- bzw. Münzstättenortes.

instrument all
type: Class
comment: Gesamtzahl der Instrumente eines Stueckes.
subclass of: E54 Dimension

peace place name
type: Class
subclass of: E44 Place Appellation
comment: Name des Ortes, wo die Friedensereignisse stattfanden.

design role
type: Class
comment: Herstellerrolle, wie Zeichner, Entwerfer, Stecher etc.
subclass of: E55 Type

was ordered by
type: ObjectProperty
comment: Wird im Zusammenhang mit Auftraggeberschaft vewendet.
sub property of: P15 was influenced by
inverse of: ordered

folio is part of series
type: ObjectProperty
sub property of: P67i is referred to by
comment: Spezieller Fall: E84 information object carrier is part of an information object (immateriell), wie einer Serie. Serie ist ein konzeptionelles Konstrukt, dass auch ohne alle Objekte bestehen kann.
inverse of: series has folio

series has folio
type: ObjectProperty
comment: Spezieller Fall: E84 information object carrier is part of an information object (immateriell), wie einer Serie. Serie ist ein konzeptionelles Konstrukt, dass auch ohne alle Objekte bestehen kann.
inverse of: folio is part of series
sub property of: P67 refers to