Ontology
imports: http://erlangen-crm.org/140220/
comment: Application ontology for museum documentation based on the Erlangen CRM (http://erlangen-crm.org).

artefact section definition
type: Class
comment: Definition of a section on the artefact.
subclass of: E46 Section Definition

file
type: Class
subclass of: documentation object
subclass of: Restriction
  min cardinality: 1
  on property: displays

displays
type: ObjectProperty
inverse of: is displayed by
comment: This property connects a documentation object with an image that captures a part of it's visual sensation. It can be used to represent the fact that the different objects can show the same image.
range: image
sub property of: P65 shows visual item
domain: documentation object

artefact position
type: Class
comment: Position in an exhibition or similar.
subclass of: E46 Section Definition

official relation Assignment
type: Class
subclass of: E13 Attribute Assignment
comment: dka2014

artefact
type: Class
subclass of: documentation object
comment: An artefact is an object of digital heritage usually kept in a museum.

family
type: Class
subclass of: E74 Group
comment: The grouping of a family built by two peoply who are married.

personal relation Assignment
type: Class
subclass of: E13 Attribute Assignment
comment: dka2014

has visual source
type: ObjectProperty
type: TransitiveProperty
range: documentation object
inverse of: is visual source of
comment: This property spezialises the notions of "copy of" or "similar to into a transitive, asymmetric relationship, where the domain expresses the derivative. Examples: - A photoprint of the Mona Lisa displays the Mona Lisa in the Louvre.
sub property of: P130 shows features of
domain: documentation object